Download Chromedriver Googleapis

How to run Selenium WebDriver test cases in Chrome? - Stack Overflow

How to run Selenium WebDriver test cases in Chrome? - Stack Overflow

Setup of selenium project and How to open a chrome browser – Make

Setup of selenium project and How to open a chrome browser – Make

Chrome 73 arrives with support for hardware media keys, PWAs and

Chrome 73 arrives with support for hardware media keys, PWAs and

How to set chrome browser driver system property ? Selenium

How to set chrome browser driver system property ? Selenium

Unable to Open Chrome Driver Browser - Web Testing - Katalon Community

Unable to Open Chrome Driver Browser - Web Testing - Katalon Community

About the Selenium WebDriver Engine - SOAtest and Virtualize 9 10 3

About the Selenium WebDriver Engine - SOAtest and Virtualize 9 10 3

Setting up a Selenium web scraper on AWS Lambda with Python

Setting up a Selenium web scraper on AWS Lambda with Python

Setup of selenium project and How to open a chrome browser – Make

Setup of selenium project and How to open a chrome browser – Make

Selenium WebDriver Recipes in C# - PDF

Selenium WebDriver Recipes in C# - PDF

Selenium C# – Adding Chrome driver to execute scripts on Chrome

Selenium C# – Adding Chrome driver to execute scripts on Chrome

Setting up a Digital Ocean server for Selenium, Chrome, and Python

Setting up a Digital Ocean server for Selenium, Chrome, and Python

Running Selenium Webdriver Test In Google Chrome

Running Selenium Webdriver Test In Google Chrome

Selenium WebDriver Using Chrome WebDriver in Visual Studio C#

Selenium WebDriver Using Chrome WebDriver in Visual Studio C#

Selenium With Node js and Mocha: Automated Testing With JavaScript

Selenium With Node js and Mocha: Automated Testing With JavaScript

Google Chrome Developer Tools - Google Chrome

Google Chrome Developer Tools - Google Chrome

Selenium with C#: Why data driven testing requires PATH to be

Selenium with C#: Why data driven testing requires PATH to be

Selenium Series - The First WebDriver Test | Octopus Deploy

Selenium Series - The First WebDriver Test | Octopus Deploy

Change chromedriver for GXtest - GXtest Wiki

Change chromedriver for GXtest - GXtest Wiki

Chromium org Analytics - Market Share Stats & Traffic Ranking

Chromium org Analytics - Market Share Stats & Traffic Ranking

Creating a Web Driver package and fixing stdlib bugs in the Nim programming  language

Creating a Web Driver package and fixing stdlib bugs in the Nim programming language

When I try run test, browser not open - Web Testing - Katalon Community

When I try run test, browser not open - Web Testing - Katalon Community

NuGet Gallery | Packages matching Tags:

NuGet Gallery | Packages matching Tags:"chrome"

How to Download & Install Previous Old Version of Google Chrome

How to Download & Install Previous Old Version of Google Chrome

How to Run Selenium Webdriver in chrome browser using drivers

How to Run Selenium Webdriver in chrome browser using drivers

How to Run Selenium Tests in Docker | BlazeMeter

How to Run Selenium Tests in Docker | BlazeMeter

Set up Selenium for Firefox and Chrome - Michal Zalecki

Set up Selenium for Firefox and Chrome - Michal Zalecki

Running Behat Tests in a Vagrant Box | Lullabot

Running Behat Tests in a Vagrant Box | Lullabot

Toolbox for Selenium Tests in Java: WebDriverManager and Selenium-Jup…

Toolbox for Selenium Tests in Java: WebDriverManager and Selenium-Jup…

How to run a Selenium Performance Test – BlazeMeter

How to run a Selenium Performance Test – BlazeMeter

C# selenium webdriver raise InvalidOperationException ocurred in

C# selenium webdriver raise InvalidOperationException ocurred in

When I try run test, browser not open - Web Testing - Katalon Community

When I try run test, browser not open - Web Testing - Katalon Community

Selenium Beginner 8 - How to run test on Chrome Browser - Automation

Selenium Beginner 8 - How to run test on Chrome Browser - Automation

Latest webdriver-manager is installing chromedriver 75 while the

Latest webdriver-manager is installing chromedriver 75 while the

How To Update Google Chrome to the Latest Version

How To Update Google Chrome to the Latest Version

Fix ERR_TUNNEL_CONNECTION_FAILED error in Google Chrome - Troubleshooter

Fix ERR_TUNNEL_CONNECTION_FAILED error in Google Chrome - Troubleshooter

How to set chrome browser driver system property ? Selenium

How to set chrome browser driver system property ? Selenium

UI Recorder + Selenium standalone server environment setup

UI Recorder + Selenium standalone server environment setup

Reptile -- selenium, PhantomJS - Programmer Sought

Reptile -- selenium, PhantomJS - Programmer Sought

Setup of selenium project and How to open a chrome browser – Make

Setup of selenium project and How to open a chrome browser – Make

Setup of selenium project and How to open a chrome browser – Make

Setup of selenium project and How to open a chrome browser – Make

Chapter 4 - Coding Your First Test Using  NET Core

Chapter 4 - Coding Your First Test Using NET Core

SOLVED] Python selenium common exceptions WebDriverException

SOLVED] Python selenium common exceptions WebDriverException

Automating Browsers with Ruby and Watir-webdriver

Automating Browsers with Ruby and Watir-webdriver

Python Archives - The Tara NightsThe Tara Nights

Python Archives - The Tara NightsThe Tara Nights

Automation Tutorial: Simple Facebook login using Selenium & Python

Automation Tutorial: Simple Facebook login using Selenium & Python

Chromium browser 64 bit download windows

Chromium browser 64 bit download windows

Running codeception functional test cases with CircleCI – 7 Colours Blog

Running codeception functional test cases with CircleCI – 7 Colours Blog

OAuth2: Authenticate Users with Google - Google Chrome

OAuth2: Authenticate Users with Google - Google Chrome

Override Chrome Driver Version - Test Automation for Salesforce | Provar

Override Chrome Driver Version - Test Automation for Salesforce | Provar

Java - reference maven dependency - Selenium Chromedriver - Stack

Java - reference maven dependency - Selenium Chromedriver - Stack

WebDriverException: unknown error: failed to change window state to

WebDriverException: unknown error: failed to change window state to

How GitLab switched to Headless Chrome for testing | GitLab

How GitLab switched to Headless Chrome for testing | GitLab

How to fix common Selenium errors? - Ultimate QA

How to fix common Selenium errors? - Ultimate QA

Toolbox for Selenium Tests in Java: WebDriverManager and Selenium-Jup…

Toolbox for Selenium Tests in Java: WebDriverManager and Selenium-Jup…

Selenium C# – Adding Chrome driver to execute scripts on Chrome

Selenium C# – Adding Chrome driver to execute scripts on Chrome

Mangadaku , Learn Shell Scripting, Learn Selenium automation, Linux

Mangadaku , Learn Shell Scripting, Learn Selenium automation, Linux

Selenium Chromedriver Error Message: u'unknown error: unable to

Selenium Chromedriver Error Message: u'unknown error: unable to

About the Selenium WebDriver Engine - SOAtest and Virtualize 9 10 3

About the Selenium WebDriver Engine - SOAtest and Virtualize 9 10 3

Setup Java-Selenium Webdriver from scratch and Run a Sample Selenium

Setup Java-Selenium Webdriver from scratch and Run a Sample Selenium

How to Continuously Deploy a Chrome Extension - CircleCI

How to Continuously Deploy a Chrome Extension - CircleCI

Selenium Series - Preparing the resources | Octopus Deploy

Selenium Series - Preparing the resources | Octopus Deploy

Selenium 使用Chrome 瀏覽器webdriver - IT閱讀

Selenium 使用Chrome 瀏覽器webdriver - IT閱讀

Web Scraping Lecture 10 - Selenium - ppt download

Web Scraping Lecture 10 - Selenium - ppt download

The ChromeDriver could not be found on the current PATH · Issue #664

The ChromeDriver could not be found on the current PATH · Issue #664

Nadim's Blog: How to run Selenium IDE script in different browser

Nadim's Blog: How to run Selenium IDE script in different browser

Python – Installation (Selenium and Chrome Driver), Open URL, and

Python – Installation (Selenium and Chrome Driver), Open URL, and

Ruby: Creating Selenium tests using headless Chrome and Ruby2

Ruby: Creating Selenium tests using headless Chrome and Ruby2

Getting

Getting "The path to the driver executable must be set by the

Getting Started with Selenium and Visual Studio | SpringerLink

Getting Started with Selenium and Visual Studio | SpringerLink

Selenium Series - The First WebDriver Test | Octopus Deploy

Selenium Series - The First WebDriver Test | Octopus Deploy

Selenium and Chromedriver - Wanna Be A Geeeeeeeeeek!!!!!

Selenium and Chromedriver - Wanna Be A Geeeeeeeeeek!!!!!

Install Selenium on an Ubuntu Cloud Server | gridscale Developer

Install Selenium on an Ubuntu Cloud Server | gridscale Developer

Installing an older homebrew package | remarkablemark

Installing an older homebrew package | remarkablemark

Cross Browser Testing with Selenium | Pragmatic Test Labs

Cross Browser Testing with Selenium | Pragmatic Test Labs

Selenium Beginner 8 - How to run test on Chrome Browser - Automation

Selenium Beginner 8 - How to run test on Chrome Browser - Automation

Download latest stable Chromium binaries (64-bit and 32-bit)

Download latest stable Chromium binaries (64-bit and 32-bit)

OAuth2: Authenticate Users with Google - Google Chrome

OAuth2: Authenticate Users with Google - Google Chrome

Selenium Series - What is WebDriver and Selenium? | Octopus Deploy

Selenium Series - What is WebDriver and Selenium? | Octopus Deploy

Watir - Installing Drivers for Browsers

Watir - Installing Drivers for Browsers

Web Automation Using With Selenium WebDriver(Chrome) + Python3

Web Automation Using With Selenium WebDriver(Chrome) + Python3

How can I use just only chromedriver to start selenium standalone

How can I use just only chromedriver to start selenium standalone

Solved] Bench update from v9 to v10 failed due to npm install

Solved] Bench update from v9 to v10 failed due to npm install

What's New In DevTools (Chrome 65) | Web | Google Developers

What's New In DevTools (Chrome 65) | Web | Google Developers

How to block automatic Google Chrome updates - gHacks Tech News

How to block automatic Google Chrome updates - gHacks Tech News

Selenium Webdriver Performance testing with Jmeter and Selenium Grid

Selenium Webdriver Performance testing with Jmeter and Selenium Grid

Installation – Cucumber-WatirWebDriver — Steemit

Installation – Cucumber-WatirWebDriver — Steemit

ReelPhish – Automated Real Time Phishing  – Security List Network™

ReelPhish – Automated Real Time Phishing – Security List Network™

How to Configure Selenium WebDriver to Run in Eclipse, programming wi…

How to Configure Selenium WebDriver to Run in Eclipse, programming wi…

Watir - Installing Drivers for Browsers

Watir - Installing Drivers for Browsers